{"text_format":"2","workbook":"xlsx","n_sheets":3,"sheets":["예산세부내역","KOTRA 기준단가","국외여비기준"],"not_rendered":{"charts":0,"images":0,"macros":0,"external_links":0,"defined_names":2,"comments":1,"pivot_tables":0},"unopened":[],"bounds":{"document_bytes":16777216,"sheet_cells":100000,"run_cost":"one","rows_first":2000,"rows_last":500,"rows_between":2000,"halvings":0,"cell_chars":16384,"cell_head_chars":4096},"cells_cut":0,"cells_raw":0,"read":"whole","date_system":"1900"}

{"sheet":"예산세부내역","index":0,"n_rows":70,"n_cols":14,"rows_kept":70,"cut":false,"hidden":false,"merged":[[0,0,0,10],[7,0,8,0],[9,0,10,0],[59,2,59,4],[60,2,60,4],[41,2,41,3],[11,3,11,4],[17,3,17,4],[18,3,18,4],[6,2,6,4],[2,1,2,4],[3,2,3,4],[32,6,32,7],[31,6,31,7],[30,6,30,7],[29,6,29,7],[28,6,28,7],[26,2,26,4],[24,2,24,4],[4,2,4,4],[20,6,20,7],[19,6,19,7],[18,6,18,7],[17,6,17,7],[5,2,5,4],[13,2,13,4],[14,2,14,4],[22,6,22,7],[21,6,21,7],[9,2,9,4],[10,2,10,4],[7,2,7,4],[62,2,62,3],[19,3,19,4],[12,1,12,5],[16,1,16,5],[56,2,56,4],[37,3,37,4],[35,3,35,4],[40,1,40,5],[53,1,53,5],[55,2,55,4],[34,3,34,4],[33,1,33,5],[32,1,32,5],[30,2,30,4],[29,2,29,4],[58,2,58,4],[61,3,61,4],[67,0,67,9],[68,0,68,9],[69,0,69,9],[38,1,38,5],[54,2,54,4],[39,1,39,5],[63,1,63,5],[64,0,64,5],[66,0,66,9],[53,6,53,7],[41,6,41,7],[39,6,39,7],[56,6,56,7],[55,6,55,7],[64,6,64,7],[63,6,63,7],[62,6,62,7],[58,6,58,7],[57,6,57,7],[42,6,42,7],[61,6,61,7],[52,6,52,7],[38,6,38,7],[59,6,59,7],[43,2,43,4],[50,2,50,4],[16,12,16,13],[8,2,8,4],[45,2,45,4],[46,2,46,4],[47,2,47,4],[48,2,48,4],[49,2,49,4],[45,6,45,7],[46,6,46,7],[47,6,47,7],[48,6,48,7],[49,6,49,7],[51,2,51,4],[51,6,51,7],[60,6,60,7],[15,6,15,7],[7,5,8,5],[44,1,44,5],[44,6,44,7],[43,6,43,7],[50,6,50,7],[34,6,34,7],[33,6,33,7],[26,6,26,7],[25,6,25,7],[24,6,24,7],[23,6,23,7],[27,6,27,7],[13,6,13,7],[14,6,14,7],[15,1,15,5],[52,1,52,5],[54,6,54,7],[16,6,16,7],[12,6,12,7],[37,6,37,7],[36,6,36,7],[35,6,35,7]]}
["2022 + 국가명 + 도시명 + 품목 + 전시회명 + 수출컨소시엄 순으로 제목 기재\nex) 2022 중국 홍콩 소비재 메가쇼 수출컨소시엄",{"$nulls":10},"* 노란색 부분만 기재하여 주시기 바랍니다."]
[]
["주관단체명","00조합/협회 등",null,null,null,"* 검색시 도시명이 없는 경우, 동일국가 최근접 도시로 선택",{"$nulls":5},"* 현재 입력된 것은 예시 입니다"]
["시작일시","완료일시","전시기간",null,null,"전시국가","단가기준도시","참여업체수","기본부스면적(㎡)","초청바이어수"]
["2022-03-01","2022-03-04",{"$f":"DAYS360(A5,B5)+1","v":4},null,null,"미국(시카고)","시카고",10,9,6]
["임차단가(㎡)","임차료통화","등록비",null,null,"보험료단가","VAT(%)","운송단가(1cbm)","회선임차","주관단체항공료"]
[296,"USD",450,null,null,0.6,0.05,1200000,2632800,1296000]
["1단계","바이어발굴 및 매칭·수출컨설팅","해외마케팅·홍보",null,null,"2단계","차량임차","통역원수"]
[null,6000000,5000000,null,null,null,500000,11]
["3단계","3단계 상담일수","바이어항공료",null,null,"상담장임차","차량임차","신용조사단가","통역단가"]
[null,1,700000,null,null,2000000,500000,100000,200000]
[]
["예산용도"," 세부내역",{"$nulls":4},"지원금액",null,"개산급 지급액","사후 지급액","업체부담금"]
["사전준비단계"," - 바이어발굴 및 매칭 ·수출컨설팅",{"$f":"MIN(B9,H5*1000000)","v":6000000},null,null,1,{"$f":"C14*F14","v":6000000},null,{"$f":"G14*0.8","v":4800000},{"$f":"G14-I14","v":1200000},{"$f":"C14-G14","v":0}]
[null," - 해외마케팅·홍보",{"$f":"MIN(C9,H5*1000000)","v":5000000},null,null,1,{"$f":"C15*F15","v":5000000},null,{"$f":"G15*0.8","v":4000000},{"$f":"G15-I15","v":1000000},{"$f":"C15-G15","v":0}]
[null,"소  계",{"$nulls":4},{"$f":"SUM(G14:H15)","v":11000000},null,{"$f":"SUM(I14:I15)","v":8800000},{"$f":"SUM(J14:J15)","v":2200000},{"$f":"SUM(K14:K15)","v":0}]
["현지활동단계","ㅇ부스임차료(70%)",{"$nulls":4},{"$f":"PRODUCT(F19,F20,F22)*0.7","v":22191120},null,{"$f":"G17*0.8","v":17752896},{"$f":"G17-I17","v":4438224},{"$f":"PRODUCT(F19,F20,F22)*0.3","v":9510480},null,"비고"]
[null," - 지원 업체수",null,"업체",null,{"$f":"H5","v":10},{"$nulls":6},"용역비",{"$f":"G14","v":6000000}]
[null," - 임차료 단가",null,"/㎡",null,{"$f":"A7","v":296},{"$nulls":6},"총 사업비",{"$f":"G16+G33+G39+G40+G45+G53","v":120231011}]
[null," - 지원규모",null,"㎡",null,{"$f":"F18*F21","v":90},{"$nulls":6},"(사업비 15%)",{"$f":"N19*0.15","v":18034651.649999999}]
[null,"   - 1부스 규모",null,null,null,{"$f":"I5","v":9},{"$nulls":6},"구성운영비 초과여부",{"$f":"IF(MIN(SUM(G59:H63),N20)>15000000,\"초과\",\"정상\")","v":"정상"}]
[null," - 환 율","(",{"$f":"B7","v":"USD"},")",{"$f":"VLOOKUP($D22,'KOTRA 기준단가'!$I$1:$J$7,2,0)","v":1190},{"$nulls":6},"1차보조금",{"$f":"I65","v":100603145.8}]
[null,"ㅇ등록비 등",{"$nulls":4},{"$f":"SUM(G24,G28,G32)","v":5077611},null,{"$f":"G23*0.8","v":4062088.8000000003},{"$f":"G23-I23","v":1015522.1999999997},{"$f":"SUM(K24,K28,K32)","v":1606500},null,"업체부담금",{"$f":"K65/H5","v":3381510}]
[null,"ㅇ등록비(70%)",{"$nulls":4},{"$f":"PRODUCT(F25:F27)*0.7","v":3748499.9999999995},null,{"$f":"G24*0.8","v":2998800},{"$f":"G24-I24","v":749699.99999999953},{"$f":"PRODUCT(F25:F27)*0.3","v":1606500}]
[null," - 등록비 단가","/업체",null,null,{"$f":"C7","v":450}]
[null," - 지원 업체수",null,null,null,{"$f":"F18","v":10}]
[null," - 환율","원/",null,null,{"$f":"F22","v":1190}]
[null,"ㅇVAT",{"$nulls":4},{"$f":"F29*(F30+F31)","v":1296981},null,{"$f":"G28*0.8","v":1037584.8},{"$f":"G28-I28","v":259396.19999999995}]
[null," - 세율",null,null,null,{"$f":"G7","v":0.05}]
[null,null,"등록비(0.7)",null,null,{"$f":"G24","v":3748499.9999999995}]
[null,null,"임차료(0.7)",null,null,{"$f":"G17","v":22191120}]
[null,"ㅇ보험료",null,null,null,{"$f":"F7","v":0.6},{"$f":"F32*F22*F20*0.5","v":32130},null,{"$f":"G32*0.8","v":25704},{"$f":"G32-I32","v":6426}]
[null,"소  계",{"$nulls":4},{"$f":"G17+G23","v":27268731},null,{"$f":"I17+I23","v":21814984.800000001},{"$f":"J17+J23","v":5453746.1999999993},{"$f":"K17+K23","v":11116980}]
[null,"ㅇ부스장치비",{"$nulls":4},{"$f":"PRODUCT(F35:F38)","v":38684520},null,{"$f":"G34*0.8","v":30947616},{"$f":"G34-I34","v":7736904},{"$f":"PRODUCT(F35,F36,F37,(1-F38))","v":16579080.000000002}]
[null," - 참가면적",null,null,null,{"$f":"F20","v":90}]
[null," - 장치비단가",null,"/㎡",null,{"$f":"VLOOKUP($G$5,'KOTRA 기준단가'!$B$2:$E$138,3,0)","v":516}]
[null," - 환 율","(",{"$f":"VLOOKUP($G$5,'KOTRA 기준단가'!$B$1:$E$138,2,0)","v":"USD"},")",{"$f":"VLOOKUP($D37,'KOTRA 기준단가'!$I$1:$J$7,2,0)","v":1190}]
[null," - 지원비율",null,null,null,0.7]
[null,"소  계",{"$nulls":4},{"$f":"G34","v":38684520},null,{"$f":"I34","v":30947616},{"$f":"J34","v":7736904},{"$f":"K34","v":16579080.000000002}]
[null,"ㅇ전시물품 운송료",{"$nulls":4},{"$f":"C42*F18","v":12000000},null,{"$f":"G40*0.8","v":9600000},{"$f":"G40-I40","v":2400000},0]
[]
[null," - 1CBM 단가",{"$f":"H7","v":1200000},null,"원"]
[null,"ㅇ 통역",{"$f":"D37","v":"USD"},{"$f":"VLOOKUP($G$5,'KOTRA 기준단가'!$B$1:$E$138,4,0)","v":380},{"$f":"C5","v":4},{"$f":"H9","v":11},{"$f":"E43*D43*F37*F43*0.7","v":13927760},null,{"$f":"G43*0.8","v":11142208},{"$f":"G43-I43","v":2785552},{"$f":"PRODUCT(D43*E43*F43*F37)*0.3","v":5969040}]
[null,"ㅇ 차량 임차",{"$f":"G9","v":500000},null,null,0.7,{"$f":"C44*F44","v":350000},null,{"$f":"G44*0.8","v":280000},{"$f":"G44-I44","v":70000},{"$f":"C44-G44","v":150000}]
[null,"소  계",{"$nulls":4},{"$f":"SUM(G40:H44)","v":26277760},null,{"$f":"SUM(I43:I44)","v":11422208},{"$f":"SUM(J43:J44)","v":2855552},{"$f":"SUM(K43:K44)","v":6119040}]
["사후관리단계"]
[]
[]
[]
[]
[]
[null," - 샘플발송비",1000000,null,null,5,{"$f":"C52*F52","v":5000000},null,{"$f":"G52*0.8","v":4000000},{"$f":"G52-I52","v":1000000},{"$f":"C52*F52-G52","v":0}]
[null,"소  계",{"$nulls":4},{"$f":"SUM(G46:H52)","v":5000000},null,{"$f":"SUM(I46:I52)","v":4000000},{"$f":"SUM(J46:J52)","v":1000000},{"$f":"SUM(K46:K51)","v":0}]
["운영비","ㅇ 공동홍보관 운영"]
[null,null,"단가",null,null,"규모"]
[null," - 부스임차(㎡)",null,null,null,{"$f":"I5","v":9},{"$f":"F56*F19*F22","v":3170160},null,{"$f":"G56*0.9","v":2853144},{"$f":"G56-I56","v":317016}]
[null," - 장치비",{"$nulls":4},{"$f":"F36*F56*F37","v":5526360},null,{"$f":"G57*0.9","v":4973724},552636]
[null," - 회선임차",{"$nulls":4},{"$f":"I7","v":2632800},null,{"$f":"G58*0.9","v":2369520},{"$f":"G58-I58","v":263280}]
[null," - 기타운영",50000,null,null,{"$f":"H5","v":10},{"$f":"MIN(C59*F59,1000000)","v":500000},null,{"$f":"G59*0.9","v":450000},50000]
[null," - 사전간담회(국내)",50000,null,null,{"$f":"H5","v":10},{"$f":"MIN(C60*F60,1000000)","v":500000},null,{"$f":"G60*0.9","v":450000},{"$f":"G60-I60","v":50000}]
[null," - 현지간담회",50000,null,null,{"$f":"H5","v":10},{"$f":"MIN(C61*F61,1000000)","v":500000},null,450000,50000]
[null," - 항공료(주관단체1인)",null,"업체",null,{"$f":"H5","v":10},{"$f":"J7*IF(F62>=16,\"2\",\"1\")","v":1296000},null,{"$f":"G62*0.9","v":1166400},129600]
[null," - 국외여비(주관단체1인)",{"$f":"VLOOKUP($G$5,국외여비기준!$E$1:$L$130,7,0)*E63","v":1613640},null,{"$f":"E43+2","v":6},{"$f":"C63-VLOOKUP($G$5,국외여비기준!$E$1:$L$130,8,FALSE)","v":1450610},{"$f":"F63*IF(F62>=16,\"2\",\"1\")","v":1450610},null,{"$f":"G63*0.9","v":1305549},145061]
[null,"소 계",{"$nulls":4},{"$f":"SUM(G56:H63)","v":15575930},null,{"$f":"SUM(I56:I63)","v":14018337},{"$f":"SUM(J56:J63)","v":1557593},0]
["총 계",{"$nulls":5},{"$f":"G16+G33+G39+G45+G53+G64","v":123806941},null,{"$f":"I16+I33+I39+I40+I45+I53+I64","v":100603145.8},{"$f":"J16+J33+J39+J40+J45+J53+J64","v":23203795.199999999},{"$f":"K16+K33+K39+K40+K45+K53+K64","v":33815100}]
[]
["* 해외전시포탈 업로드 : 예산서(엑셀), 전시회브로셔(1㎡당 단가, 회선임차 단가 포함), 해상운송(편도 1cbm) 견적서"]
["* 부스임차료, 장치비, 운송료, 운영비간 항목조정은 \"수출컨소시엄 운영지침\" 참조 / 지원환율은 변동가능"]
["* 사후정산 신청시 정산서류는 사본 제출(원본대조필 날인)"]
["* 문의처 : 중소기업중앙회 무역촉진부 신자은 차장, 임선우 차장, 소재민 차장, 김원일 과장, 김예민 과장 (02-2124-3291~5)"]

{"sheet":"KOTRA 기준단가","index":1,"n_rows":138,"n_cols":10,"rows_kept":138,"cut":false,"hidden":false,"merged":[]}
["순번","지역","통화","장치비(㎡)","통역원(일)","비고(무역관 없는 지역은 가장 가까운 무역관 단가 적용)",null,null,"통화","(2021 기준)"]
[1,"런던","GBP",290,165,null,null,null,"CNY",180]
[2,"마드리드","EUR",400,300,null,null,null,"EUR",1370]
[3,"뮌헨","EUR",380,230,null,null,null,"JPY",1040]
[4,"밀라노","EUR",396,300,null,null,null,"USD",1190]
[5,"바르샤바","EUR",275,200,null,null,null,"영국£",1500]
[6,"베오그라드","EUR",250,220,null,null,null,"싱가폴$",870]
[7,"부다페스트","EUR",260,280]
[8,"부쿠레슈티","EUR",250,200]
[9,"브라티슬라바","EUR",250,200]
[10,"브뤼셀","EUR",336,200]
[11,"빈","EUR",250,200]
[12,"소피아","EUR",250,200]
[13,"스톡홀름","USD",340,395]
[14,"아테네","EUR",260,200]
[15,"암스테르담","EUR",300,220]
[16,"자그레브","EUR",275,200]
[17,"취리히","CHF",444,400]
[18,"쾰른","EUR",380,200,"프랑크푸르트"]
[19,"프리드리히샤펀","EUR",380,200,"프랑크푸르트"]
[20,"뒤셀도르프","EUR",380,200,"프랑크푸르트"]
[21,"뉴렌버그","EUR",380,200,"프랑크푸르트"]
[22,"코펜하겐","USD",340,390]
[23,"파리","EUR",330,220]
[24,"프라하","EUR",260,200]
[25,"프랑크푸르트","EUR",380,200]
[26,"함부르크","EUR",380,210]
[27,"헬싱키","EUR",330,225]
[28,"베로나","EUR",396,300,"밀라노"]
[29,"뉴욕","USD",516,350]
[30,"달라스","USD",516,300]
[31,"디트로이트","USD",516,300]
[32,"로스앤젤레스","USD",516,500]
[33,"라스베가스","USD",516,500,"로스앤젤레스"]
[34,"애너하임","USD",516,500,"로스앤젤레스"]
[35,"미시건","USD",516,300,"디트로이트"]
[36,"밴쿠버","CAD",480,400]
[37,"시카고","USD",516,380]
[38,"실리콘밸리","USD",516,300]
[39,"워싱턴","USD",516,320]
[40,"토론토","CAD",480,400]
[41,"과테말라","USD",250,240]
[42,"리마","USD",198,210]
[43,"멕시코시티","USD",300,242]
[44,"보고타","USD",198,200]
[45,"부에노스아이레스","USD",250,227]
[46,"산토도밍고","USD",190,200]
[47,"산티아고","USD",250,207]
[48,"상파울루","USD",330,245]
[49,"아바나","CAD",330,200]
[50,"아순시온","USD",165,160]
[51,"키토","USD",165,250]
[52,"파나마","USD",275,250]
[53,"뉴델리","USD",253,253]
[54,"다낭","USD",216,216]
[55,"다카","USD",130,130]
[56,"마닐라","USD",170,170]
[57,"멜버른","AUD",576,576]
[58,"뭄바이","USD",253,253]
[59,"방콕","USD",200,200]
[60,"벵갈루루","USD",253,253]
[61,"비엔티안","USD",120,120]
[62,"수라바야","USD",170,170]
[63,"시드니","AUD",576,576]
[64,"싱가포르","SGD",420,420]
[65,"암다바드","USD",253,253]
[66,"양곤","USD",150,150]
[67,"오클랜드","USD",413,413]
[68,"자카르타","USD",170,170]
[69,"첸나이","USD",253,253]
[70,"카라치","USD",144,144]
[71,"콜롬보","USD",170,170]
[72,"콜카타","USD",253,253]
[73,"쿠알라룸푸르","USD",220,220]
[74,"프놈펜","USD",120,120]
[75,"하노이","USD",216,216]
[76,"호치민","USD",216,216]
[77,"나고야","JPY",39600,39600]
[78,"도쿄","JPY",39600,39600]
[79,"오사카","JPY",39600,39600]
{"$rows_left_out":59}
{"sheet":"국외여비기준","index":2,"n_rows":130,"n_cols":18,"rows_kept":130,"cut":false,"hidden":false,"merged":[]}
["연번","구분","국가","구분","지역","통화","일비","숙박비","식비","환율","원화","1일숙박 제외",null,null,null,"일비","숙박비","식비"]
[1,"아메리카","미국","가","뉴욕","USD",{"$f":"VLOOKUP($D2,$O$2:$R$5,2,0)","v":30},{"$f":"VLOOKUP($D2,$O$2:$R$5,3,0)","v":176},{"$f":"VLOOKUP($D2,$O$2:$R$5,4,0)","v":81},{"$f":"VLOOKUP(F2,'KOTRA 기준단가'!$I$1:$J$7,2,0)","v":1190},{"$f":"(G2+H2+I2)*J2","v":341530},{"$f":"J2*H2","v":209440},null,null,"가",30,176,81]
[2,"아시아","일본","가","도쿄","USD",30,176,81,{"$f":"VLOOKUP(F3,'KOTRA 기준단가'!$I$1:$J$7,2,0)","v":1190},341530,209440,null,null,"나",30,137,59]
[3,"유럽주","영국","가","런던","USD",30,176,81,{"$f":"VLOOKUP(F4,'KOTRA 기준단가'!$I$1:$J$7,2,0)","v":1190},341530,209440,null,null,"다",30,106,44]
[4,"아메리카","미국","가","로스앤젤레스","USD",30,176,81,{"$f":"VLOOKUP(F5,'KOTRA 기준단가'!$I$1:$J$7,2,0)","v":1190},341530,209440,null,null,"라",30,81,37]
[5,"유럽주","러시아","가","모스크바","USD",30,176,81,{"$f":"VLOOKUP(F6,'KOTRA 기준단가'!$I$1:$J$7,2,0)","v":1190},341530,209440]
[6,"아메리카","미국","가","샌프란시스코","USD",30,176,81,{"$f":"VLOOKUP(F7,'KOTRA 기준단가'!$I$1:$J$7,2,0)","v":1190},341530,209440]
[7,"아메리카","미국","가","워싱턴","USD",30,176,81,{"$f":"VLOOKUP(F8,'KOTRA 기준단가'!$I$1:$J$7,2,0)","v":1190},341530,209440]
[8,"유럽주","프랑스","가","파리","USD",30,176,81,{"$f":"VLOOKUP(F9,'KOTRA 기준단가'!$I$1:$J$7,2,0)","v":1190},341530,209440]
[9,"아시아","중국","가","홍콩","USD",30,176,81,{"$f":"VLOOKUP(F10,'KOTRA 기준단가'!$I$1:$J$7,2,0)","v":1190},341530,209440]
[10,"유럽주","스위스","가","제네바","USD",30,176,81,{"$f":"VLOOKUP(F11,'KOTRA 기준단가'!$I$1:$J$7,2,0)","v":1190},341530,209440]
[11,"아시아","싱가포르","가","싱가포르","USD",30,176,81,{"$f":"VLOOKUP(F12,'KOTRA 기준단가'!$I$1:$J$7,2,0)","v":1190},{"$f":"(G12+H12+I12)*J12","v":341530},{"$f":"J12*H12","v":209440}]
[12,"아시아","대만","나","타이완","USD",30,137,59,{"$f":"VLOOKUP(F13,'KOTRA 기준단가'!$I$1:$J$7,2,0)","v":1190},{"$f":"(G13+H13+I13)*J13","v":268940},{"$f":"J13*H13","v":163030}]
[13,"아시아","중국","나","베이징","USD",30,137,59,{"$f":"VLOOKUP(F14,'KOTRA 기준단가'!$I$1:$J$7,2,0)","v":1190},268940,163030]
[14,"아시아","인도","나","뉴델리","USD",30,137,59,{"$f":"VLOOKUP(F15,'KOTRA 기준단가'!$I$1:$J$7,2,0)","v":1190},268940,163030]
[15,"아시아","인도","나","뭄바이","USD",30,137,59,{"$f":"VLOOKUP(F16,'KOTRA 기준단가'!$I$1:$J$7,2,0)","v":1190},268940,163030]
[16,"아시아","인도","나","방갈로르","USD",30,137,59,{"$f":"VLOOKUP(F17,'KOTRA 기준단가'!$I$1:$J$7,2,0)","v":1190},268940,163030]
[17,"아시아","인도","나","벵갈루루","USD",30,137,59,{"$f":"VLOOKUP(F18,'KOTRA 기준단가'!$I$1:$J$7,2,0)","v":1190},268940,163030]
[18,"아시아","일본","나","오사카","USD",30,137,59,{"$f":"VLOOKUP(F19,'KOTRA 기준단가'!$I$1:$J$7,2,0)","v":1190},268940,163030]
[19,"아시아","일본","나","치바","USD",30,137,59,{"$f":"VLOOKUP(F20,'KOTRA 기준단가'!$I$1:$J$7,2,0)","v":1190},268940,163030]
[20,"아시아","일본","나","후쿠오카","USD",30,137,59,{"$f":"VLOOKUP(F21,'KOTRA 기준단가'!$I$1:$J$7,2,0)","v":1190},268940,163030]
[21,"아시아","일본","나","나고야","USD",30,137,59,{"$f":"VLOOKUP(F22,'KOTRA 기준단가'!$I$1:$J$7,2,0)","v":1190},268940,163030]
[22,"아시아","카자흐스탄","나","알마티","USD",30,137,59,{"$f":"VLOOKUP(F23,'KOTRA 기준단가'!$I$1:$J$7,2,0)","v":1190},268940,163030]
[23,"아메리카","멕시코","나","멕시코시티","USD",30,137,59,{"$f":"VLOOKUP(F24,'KOTRA 기준단가'!$I$1:$J$7,2,0)","v":1190},268940,163030]
[24,"아메리카","미국","나","디트로이트","USD",30,137,59,{"$f":"VLOOKUP(F25,'KOTRA 기준단가'!$I$1:$J$7,2,0)","v":1190},268940,163030]
[25,"아메리카","미국","나","라스베가스","USD",30,137,59,{"$f":"VLOOKUP(F26,'KOTRA 기준단가'!$I$1:$J$7,2,0)","v":1190},268940,163030]
[26,"아메리카","미국","나","마이애미","USD",30,137,59,{"$f":"VLOOKUP(F27,'KOTRA 기준단가'!$I$1:$J$7,2,0)","v":1190},268940,163030]
[27,"아메리카","미국","나","애너하임","USD",30,137,59,{"$f":"VLOOKUP(F28,'KOTRA 기준단가'!$I$1:$J$7,2,0)","v":1190},268940,163030]
[28,"아메리카","미국","나","솔트레이크시티","USD",30,137,59,{"$f":"VLOOKUP(F29,'KOTRA 기준단가'!$I$1:$J$7,2,0)","v":1190},268940,163030]
[29,"아메리카","미국","나","미시건","USD",30,137,59,{"$f":"VLOOKUP(F30,'KOTRA 기준단가'!$I$1:$J$7,2,0)","v":1190},268940,163030]
[30,"아메리카","미국","나","시카고","USD",30,137,59,{"$f":"VLOOKUP(F31,'KOTRA 기준단가'!$I$1:$J$7,2,0)","v":1190},268940,163030]
[31,"아메리카","미국","나","하노버","USD",30,137,59,{"$f":"VLOOKUP(F32,'KOTRA 기준단가'!$I$1:$J$7,2,0)","v":1190},268940,163030]
[32,"아메리카","미국","나","휴스턴","USD",30,137,59,{"$f":"VLOOKUP(F33,'KOTRA 기준단가'!$I$1:$J$7,2,0)","v":1190},268940,163030]
[33,"아메리카","미국","나","달라스","USD",30,137,59,{"$f":"VLOOKUP(F34,'KOTRA 기준단가'!$I$1:$J$7,2,0)","v":1190},268940,163030]
[34,"아메리카","미국","나","실리콘밸리","USD",30,137,59,{"$f":"VLOOKUP(F35,'KOTRA 기준단가'!$I$1:$J$7,2,0)","v":1190},268940,163030]
[35,"아메리카","미국","나","오클랜드","USD",30,137,59,{"$f":"VLOOKUP(F36,'KOTRA 기준단가'!$I$1:$J$7,2,0)","v":1190},268940,163030]
[36,"아메리카","브라질","나","상파울루","USD",30,137,59,{"$f":"VLOOKUP(F37,'KOTRA 기준단가'!$I$1:$J$7,2,0)","v":1190},268940,163030]
[37,"아메리카","브라질","나","리우데자네이루","USD",30,137,59,{"$f":"VLOOKUP(F38,'KOTRA 기준단가'!$I$1:$J$7,2,0)","v":1190},268940,163030]
[38,"아메리카","아르헨티나","나","부에노스아이레스","USD",30,137,59,{"$f":"VLOOKUP(F39,'KOTRA 기준단가'!$I$1:$J$7,2,0)","v":1190},268940,163030]
[39,"아메리카","캐나다","나","밴쿠버/토론토","USD",30,137,59,{"$f":"VLOOKUP(F40,'KOTRA 기준단가'!$I$1:$J$7,2,0)","v":1190},268940,163030]
[40,"아메리카","캐나다","나","밴쿠버","USD",30,137,59,{"$f":"VLOOKUP(F41,'KOTRA 기준단가'!$I$1:$J$7,2,0)","v":1190},268940,163030]
[41,"아메리카","캐나다","나","토론토","USD",30,137,59,{"$f":"VLOOKUP(F42,'KOTRA 기준단가'!$I$1:$J$7,2,0)","v":1190},268940,163030]
[42,"유럽주","그리스","나","아테네","USD",30,137,59,{"$f":"VLOOKUP(F43,'KOTRA 기준단가'!$I$1:$J$7,2,0)","v":1190},268940,163030]
[43,"유럽주","네덜란드","나","암스테르담","USD",30,137,59,{"$f":"VLOOKUP(F44,'KOTRA 기준단가'!$I$1:$J$7,2,0)","v":1190},268940,163030]
[44,"유럽주","댄마크","나","코펜하겐","USD",30,137,59,{"$f":"VLOOKUP(F45,'KOTRA 기준단가'!$I$1:$J$7,2,0)","v":1190},268940,163030]
[45,"유럽주","독일","나","뒤셀도르프","USD",30,137,59,{"$f":"VLOOKUP(F46,'KOTRA 기준단가'!$I$1:$J$7,2,0)","v":1190},268940,163030]
[46,"유럽주","독일","나","뮌헨","USD",30,137,59,{"$f":"VLOOKUP(F47,'KOTRA 기준단가'!$I$1:$J$7,2,0)","v":1190},268940,163030]
[47,"유럽주","독일","나","베를린","USD",30,137,59,{"$f":"VLOOKUP(F48,'KOTRA 기준단가'!$I$1:$J$7,2,0)","v":1190},268940,163030]
[48,"유럽주","독일","나","프리드리히샤펀","USD",30,137,59,{"$f":"VLOOKUP(F49,'KOTRA 기준단가'!$I$1:$J$7,2,0)","v":1190},268940,163030]
[49,"유럽주","독일","나","슈투트가르트","USD",30,137,59,{"$f":"VLOOKUP(F50,'KOTRA 기준단가'!$I$1:$J$7,2,0)","v":1190},268940,163030]
[50,"유럽주","독일","나","쾰른","USD",30,137,59,{"$f":"VLOOKUP(F51,'KOTRA 기준단가'!$I$1:$J$7,2,0)","v":1190},268940,163030]
[51,"유럽주","독일","나","프랑크푸르트","USD",30,137,59,{"$f":"VLOOKUP(F52,'KOTRA 기준단가'!$I$1:$J$7,2,0)","v":1190},268940,163030]
[52,"유럽주","독일","나","뉴렌버그","USD",30,137,59,{"$f":"VLOOKUP(F53,'KOTRA 기준단가'!$I$1:$J$7,2,0)","v":1190},268940,163030]
[53,"유럽주","독일","나","함부르크","USD",30,137,59,{"$f":"VLOOKUP(F54,'KOTRA 기준단가'!$I$1:$J$7,2,0)","v":1190},268940,163030]
[54,"유럽주","러시아","나","블라디보스톡","USD",30,137,59,{"$f":"VLOOKUP(F55,'KOTRA 기준단가'!$I$1:$J$7,2,0)","v":1190},268940,163030]
[55,"유럽주","러시아","나","상트페테르부르크","USD",30,137,59,{"$f":"VLOOKUP(F56,'KOTRA 기준단가'!$I$1:$J$7,2,0)","v":1190},268940,163030]
[56,"유럽주","러시아","나","노보시비르스크","USD",30,137,59,{"$f":"VLOOKUP(F57,'KOTRA 기준단가'!$I$1:$J$7,2,0)","v":1190},268940,163030]
[57,"유럽주","벨기에","나","브뤼셀","USD",30,137,59,{"$f":"VLOOKUP(F58,'KOTRA 기준단가'!$I$1:$J$7,2,0)","v":1190},268940,163030]
[58,"유럽주","스웨덴","나","스톡홀름","USD",30,137,59,{"$f":"VLOOKUP(F59,'KOTRA 기준단가'!$I$1:$J$7,2,0)","v":1190},268940,163030]
[59,"유럽주","스위스","나","취리히","USD",30,137,59,{"$f":"VLOOKUP(F60,'KOTRA 기준단가'!$I$1:$J$7,2,0)","v":1190},268940,163030]
[60,"유럽주","스페인","나","마드리드","USD",30,137,59,{"$f":"VLOOKUP(F61,'KOTRA 기준단가'!$I$1:$J$7,2,0)","v":1190},268940,163030]
[61,"유럽주","영국","나","에버딘","USD",30,137,59,{"$f":"VLOOKUP(F62,'KOTRA 기준단가'!$I$1:$J$7,2,0)","v":1190},268940,163030]
[62,"유럽주","오스트리아","나","빈","USD",30,137,59,{"$f":"VLOOKUP(F63,'KOTRA 기준단가'!$I$1:$J$7,2,0)","v":1190},268940,163030]
[63,"유럽주","우크라이나","나","키예프","USD",30,137,59,{"$f":"VLOOKUP(F64,'KOTRA 기준단가'!$I$1:$J$7,2,0)","v":1190},268940,163030]
[64,"유럽주","이탈리아","나","밀라노","USD",30,137,59,{"$f":"VLOOKUP(F65,'KOTRA 기준단가'!$I$1:$J$7,2,0)","v":1190},268940,163030]
[65,"유럽주","이탈리아","나","베로나","USD",{"$f":"VLOOKUP($D66,$O$2:$R$5,2,0)","v":30},{"$f":"VLOOKUP($D66,$O$2:$R$5,3,0)","v":137},{"$f":"VLOOKUP($D66,$O$2:$R$5,4,0)","v":59},{"$f":"VLOOKUP(F66,'KOTRA 기준단가'!$I$1:$J$7,2,0)","v":1190},268940,163030]
[66,"유럽주","핀란드","나","헬싱키","USD",30,137,59,{"$f":"VLOOKUP(F67,'KOTRA 기준단가'!$I$1:$J$7,2,0)","v":1190},268940,163030]
[67,"유럽주","헝가리","나","부다페스트","USD",30,137,59,{"$f":"VLOOKUP(F68,'KOTRA 기준단가'!$I$1:$J$7,2,0)","v":1190},268940,163030]
[68,"중동","UAE","나","두바이","USD",30,137,59,{"$f":"VLOOKUP(F69,'KOTRA 기준단가'!$I$1:$J$7,2,0)","v":1190},268940,163030]
[69,"중동","UAE","나","아부다비","USD",30,137,59,{"$f":"VLOOKUP(F70,'KOTRA 기준단가'!$I$1:$J$7,2,0)","v":1190},268940,163030]
[70,"중동","리비아","나","트리폴리","USD",30,137,59,{"$f":"VLOOKUP(F71,'KOTRA 기준단가'!$I$1:$J$7,2,0)","v":1190},268940,163030]
[71,"중동","사우디아라비아","나","리야드","USD",30,137,59,{"$f":"VLOOKUP(F72,'KOTRA 기준단가'!$I$1:$J$7,2,0)","v":1190},268940,163030]
[72,"중동","오만","나","무스카트","USD",30,137,59,{"$f":"VLOOKUP(F73,'KOTRA 기준단가'!$I$1:$J$7,2,0)","v":1190},268940,163030]
[73,"중동","이집트","나","카이로","USD",30,137,59,{"$f":"VLOOKUP(F74,'KOTRA 기준단가'!$I$1:$J$7,2,0)","v":1190},268940,163030]
[74,"중동","카타르","나","도하","USD",30,137,59,{"$f":"VLOOKUP(F75,'KOTRA 기준단가'!$I$1:$J$7,2,0)","v":1190},268940,163030]
[75,"아프리카","남아프리카공화국","나","요하네스버그","USD",30,137,59,{"$f":"VLOOKUP(F76,'KOTRA 기준단가'!$I$1:$J$7,2,0)","v":1190},268940,163030]
[76,"아시아","말레이시아","다","쿠알라룸푸르","USD",30,106,44,{"$f":"VLOOKUP(F77,'KOTRA 기준단가'!$I$1:$J$7,2,0)","v":1190},{"$f":"(G77+H77+I77)*J77","v":214200},{"$f":"J77*H77","v":126140}]
[77,"아시아","방글라데시","다","다카","USD",30,106,44,{"$f":"VLOOKUP(F78,'KOTRA 기준단가'!$I$1:$J$7,2,0)","v":1190},214200,126140]
[78,"아시아","아제르바이잔","다","바쿠","USD",30,106,44,{"$f":"VLOOKUP(F79,'KOTRA 기준단가'!$I$1:$J$7,2,0)","v":1190},214200,126140]
[79,"아시아","인도네시아","다","자카르타","USD",30,106,44,{"$f":"VLOOKUP(F80,'KOTRA 기준단가'!$I$1:$J$7,2,0)","v":1190},214200,126140]
{"$rows_left_out":50}